Target
Serine/threonine-protein kinase Sgk1
Ligand
BDBM269143
Substrate
Meas. Tech.
Enzymatic Activity Assay
pH
7.4±n/a
IC50
<0.500±n/a nM
Comments
extracted
Citation
 Nazare, MHalland, NSchmidt, FKleemann, HWeiss, TSaas, JStruebing, C N-(4-(azaindazol-6-yl)-phenyl)-sulfonamides and their use as pharmaceuticals US Patent  US9718825 Publication Date 8/1/2017 
Target
Name:
Serine/threonine-protein kinase Sgk1
Synonyms:
SGK SGK1_HUMAN Serine/threonine-protein kinase Sgk1 (SGK) Serum/glucocorticoid-regulated kinase 1 (SGK1)
Type:
Other Protein Type
Mol. Mass.:
48954.40
Organism:
Homo sapiens (Human)
Description:
Recombinant human SGK-1 enzyme produced in a baculovirus system.
Residue:
431
  
Inhibitor
Name:
BDBM269143
Synonyms:
US9718825, Example 589
Type:
Small organic molecule
Emp. Form.:
C27H30FN5O3S
Mol. Mass.:
523.622
SMILES:
CC(C)N1CC(COc2nc(cc3[nH]nc(C)c23)-c2ccc(NS(=O)(=O)c3cc(C)ccc3F)cc2)C1
: