Target
Heat shock factor protein 1
Ligand
BDBM63366
Substrate
Meas. Tech.
Luminescence Cell-Based Dose Confimation HTS to Identify Inhibitors of Heat Shock Factor 1 (HSF1)
EC50
>195000±0 nM
Citation
 PubChem, PC Luminescence Cell-Based Dose Confimation HTS to Identify Inhibitors of Heat Shock Factor 1 (HSF1) PubChem Bioassay (2010)[AID] 
Target
Name:
Heat shock factor protein 1
Synonyms:
HSF1_MOUSE Hsf1 protein
Type:
Enzyme Catalytic Domain
Mol. Mass.:
57208.68
Organism:
Mus musculus
Description:
P38532
Residue:
525
  
Inhibitor
Name:
BDBM63366
Synonyms:
MLS000563668 cid_5459639
Type:
Small organic molecule
Emp. Form.:
C58H63N5O10
Mol. Mass.:
990.1483
SMILES:
CCCCNC(=O)C(N(CCc1c[nH]c2ccccc12)C(=O)CCCCCN1C(=O)NC(C(C(=O)OCc2ccccc2)=C1C)c1ccc(cc1)-c1ccccc1)c1ccc(OCC(=O)OC)c(c1)C(=O)OC
: