Target
Heat shock factor protein 1
Ligand
BDBM51824
Substrate
Meas. Tech.
Luminescence Cell-Based Dose Confimation HTS to Identify Inhibitors of Heat Shock Factor 1 (HSF1)
EC50
>195000±0 nM
Citation
 PubChem, PC Luminescence Cell-Based Dose Confimation HTS to Identify Inhibitors of Heat Shock Factor 1 (HSF1) PubChem Bioassay (2010)[AID] 
Target
Name:
Heat shock factor protein 1
Synonyms:
HSF1_MOUSE Hsf1 protein
Type:
Enzyme Catalytic Domain
Mol. Mass.:
57208.68
Organism:
Mus musculus
Description:
P38532
Residue:
525
  
Inhibitor
Name:
BDBM51824
Synonyms:
(2S)-6-amino-2-[4-[3-[1-[(1S)-1-(1H-indol-3-ylmethyl)-2-keto-2-methoxy-ethyl]triazol-4-yl]-5-(piperazine-1-carbonyl)phenyl]triazol-1-yl]hexanoic acid methyl ester;hydrochloride LU-MONO-WK-DP SMR000327515 methyl (2S)-6-amino-2-[4-[3-[1-[(2S)-3-(1H-indol-3-yl)-1-methoxy-1-oxopropan-2-yl]triazol-4-yl]-5-(piperazine-1-carbonyl)phenyl]triazol-1-yl]hexanoate;hydrochloride | methyl (2S)-6-azanyl-2-[4-[3-[1-[(2S)-3-(1H-indol-3-yl)-1-methoxy-1-oxidanylidene-propan-2-yl]-1,2,3-triazol-4-yl]-5-piperazin-1-ylcarbonyl-phenyl]-1,2,3-triazol-1-yl]hexanoate;hydrochloride
Type:
Small organic molecule
Emp. Form.:
C34H40N10O5
Mol. Mass.:
668.7454
SMILES:
COC(=O)[C@H](CCCCN)n1cc(nn1)-c1cc(cc(c1)-c1cn(nn1)[C@@H](Cc1c[nH]c2ccccc12)C(=O)OC)C(=O)N1CCNCC1
: