Target
Heat shock factor protein 1
Ligand
BDBM63370
Substrate
Meas. Tech.
Luminescence Cell-Based Dose Confimation HTS to Identify Inhibitors of Heat Shock Factor 1 (HSF1)
EC50
>195000±0 nM
Citation
 PubChem, PC Luminescence Cell-Based Dose Confimation HTS to Identify Inhibitors of Heat Shock Factor 1 (HSF1) PubChem Bioassay (2010)[AID] 
Target
Name:
Heat shock factor protein 1
Synonyms:
HSF1_MOUSE Hsf1 protein
Type:
Enzyme Catalytic Domain
Mol. Mass.:
57208.68
Organism:
Mus musculus
Description:
P38532
Residue:
525
  
Inhibitor
Name:
BDBM63370
Synonyms:
4-[3-(4-Dimethylamino-phenyl)-[1,2,4]oxadiazol-5-yl]-piperidine-1-carboxylic acid (4-chloro-phenyl)-amide N-(4-chlorophenyl)-4-[3-[4-(dimethylamino)phenyl]-1,2,4-oxadiazol-5-yl]-1-piperidinecarboxamide SMR000122556 | cid_1453581
Type:
Small organic molecule
Emp. Form.:
C22H24ClN5O2
Mol. Mass.:
425.911
SMILES:
CN(C)c1ccc(cc1)-c1noc(n1)C1CCN(CC1)C(=O)Nc1ccc(Cl)cc1
: