Target
Heat shock factor protein 1
Ligand
BDBM63381
Substrate
Meas. Tech.
Luminescence Cell-Based Dose Confimation HTS to Identify Inhibitors of Heat Shock Factor 1 (HSF1)
EC50
6518±3501 nM
Citation
 PubChem, PC Luminescence Cell-Based Dose Confimation HTS to Identify Inhibitors of Heat Shock Factor 1 (HSF1) PubChem Bioassay (2010)[AID] 
Target
Name:
Heat shock factor protein 1
Synonyms:
HSF1_MOUSE Hsf1 protein
Type:
Enzyme Catalytic Domain
Mol. Mass.:
57208.68
Organism:
Mus musculus
Description:
P38532
Residue:
525
  
Inhibitor
Name:
BDBM63381
Synonyms:
(5Z)-3-[2-(5-amino-1,3,4-thiadiazol-2-yl)ethyl]-5-[4-(dimethylamino)benzylidene]thiazolidine-2,4-quinone (5Z)-3-[2-(5-amino-1,3,4-thiadiazol-2-yl)ethyl]-5-[[4-(dimethylamino)phenyl]methylidene]thiazolidine-2,4-dione MLS000402370 cid_1539603
Type:
Small organic molecule
Emp. Form.:
C16H17N5O2S2
Mol. Mass.:
375.468
SMILES:
CN(C)c1ccc(\C=C2/SC(=O)N(CCc3nnc(N)s3)C2=O)cc1
: