Target
Heat shock factor protein 1
Ligand
BDBM63387
Substrate
Meas. Tech.
Luminescence Cell-Based Dose Confimation HTS to Identify Inhibitors of Heat Shock Factor 1 (HSF1)
EC50
>195000±0 nM
Citation
 PubChem, PC Luminescence Cell-Based Dose Confimation HTS to Identify Inhibitors of Heat Shock Factor 1 (HSF1) PubChem Bioassay (2010)[AID] 
Target
Name:
Heat shock factor protein 1
Synonyms:
HSF1_MOUSE Hsf1 protein
Type:
Enzyme Catalytic Domain
Mol. Mass.:
57208.68
Organism:
Mus musculus
Description:
P38532
Residue:
525
  
Inhibitor
Name:
BDBM63387
Synonyms:
2-chloranyl-6-methoxy-quinoline-3-carbonitrile 2-chloro-6-methoxy-quinoline-3-carbonitrile MLS000693020 cid_865612
Type:
Small organic molecule
Emp. Form.:
C11H7ClN2O
Mol. Mass.:
218.639
SMILES:
COc1ccc2nc(Cl)c(cc2c1)C#N
: