Target
Heat shock factor protein 1
Ligand
BDBM63388
Substrate
Meas. Tech.
Luminescence Cell-Based Dose Confimation HTS to Identify Inhibitors of Heat Shock Factor 1 (HSF1)
EC50
>195000±0 nM
Citation
 PubChem, PC Luminescence Cell-Based Dose Confimation HTS to Identify Inhibitors of Heat Shock Factor 1 (HSF1) PubChem Bioassay (2010)[AID] 
Target
Name:
Heat shock factor protein 1
Synonyms:
HSF1_MOUSE Hsf1 protein
Type:
Enzyme Catalytic Domain
Mol. Mass.:
57208.68
Organism:
Mus musculus
Description:
P38532
Residue:
525
  
Inhibitor
Name:
BDBM63388
Synonyms:
3-acetyl-4-hydroxy-2-(4-hydroxyphenyl)-1-(3-pyridinylmethyl)-2H-pyrrol-5-one 3-ethanoyl-2-(4-hydroxyphenyl)-4-oxidanyl-1-(pyridin-3-ylmethyl)-2H-pyrrol-5-one MLS000703434 cid_3141399
Type:
Small organic molecule
Emp. Form.:
C18H16N2O4
Mol. Mass.:
324.3306
SMILES:
CC(=O)C1C(N(Cc2cccnc2)C(=O)C1=O)c1ccc(O)cc1
: