Target
Heat shock factor protein 1
Ligand
BDBM62277
Substrate
Meas. Tech.
Luminescence Cell-Based Dose Confimation HTS to Identify Inhibitors of Heat Shock Factor 1 (HSF1)
EC50
3562±1051 nM
Citation
 PubChem, PC Luminescence Cell-Based Dose Confimation HTS to Identify Inhibitors of Heat Shock Factor 1 (HSF1) PubChem Bioassay (2010)[AID] 
Target
Name:
Heat shock factor protein 1
Synonyms:
HSF1_MOUSE Hsf1 protein
Type:
Enzyme Catalytic Domain
Mol. Mass.:
57208.68
Organism:
Mus musculus
Description:
P38532
Residue:
525
  
Inhibitor
Name:
BDBM62277
Synonyms:
1-[[(E)-(5-ethoxy-6-keto-cyclohexa-2,4-dien-1-ylidene)methyl]amino]-3-(2-nitrophenyl)thiourea 1-[[(E)-(5-ethoxy-6-oxo-1-cyclohexa-2,4-dienylidene)methyl]amino]-3-(2-nitrophenyl)thiourea MLS-0270696.0001 | cid_6297486
Type:
Small organic molecule
Emp. Form.:
C16H16N4O4S
Mol. Mass.:
360.388
SMILES:
CCOc1ccc[c-](C=[NH+]NC(=S)Nc2ccccc2[N+]([O-])=O)c1=O
: