Target
ATP-dependent molecular chaperone HSP82
Ligand
BDBM64883
Substrate
Meas. Tech.
Fluorescence Cell-Based Secondary Assay to Identify Inhibitors of Resistant C. albicans Growth in the Presence of Fluconazole
EC50
9525±1878 nM
Citation
 PubChem, PC Fluorescence Cell-Based Secondary Assay to Identify Inhibitors of Resistant C. albicans Growth in the Presence of Fluconazole PubChem Bioassay (2010)[AID] 
Target
Name:
ATP-dependent molecular chaperone HSP82
Synonyms:
heat shock protein 90
Type:
Enzyme Catalytic Domain
Mol. Mass.:
80784.12
Organism:
Candida albicans
Description:
gi_994798
Residue:
707
  
Inhibitor
Name:
BDBM64883
Synonyms:
1-Ethyl-4-hydroxy-2-oxo-1,2-dihydro-quinoline-3-carboxylic acid (pyridin-3-ylmethyl)-amide 1-ethyl-2-hydroxy-4-oxo-N-(3-pyridinylmethyl)-3-quinolinecarboxamide 1-ethyl-2-oxidanyl-4-oxidanylidene-N-(pyridin-3-ylmethyl)quinoline-3-carboxamide SMR000001330 | cid_650206
Type:
Small organic molecule
Emp. Form.:
C18H17N3O3
Mol. Mass.:
323.3459
SMILES:
CCn1c2ccccc2c(O)c(C(=O)NCc2cccnc2)c1=O
: