Target
Tumor necrosis factor
Ligand
BDBM65736
Substrate
Meas. Tech.
SAR analysis of inhibitors of TNFa specific NF-kB induction - Set 2
IC50
>20000±n/a nM
Citation
 PubChem, PC SAR analysis of inhibitors of TNFa specific NF-kB induction - Set 2 PubChem Bioassay (2010)[AID] 
Target
Name:
Tumor necrosis factor
Synonyms:
Cachectin TNF-a TNFA TNFSF2 Tumor necrosis factor (TNFa) Tumor necrosis factor ligand superfamily member 2 Tumor necrosis factor, soluble form | tumor necrosis factor alpha
Type:
Enzyme
Mol. Mass.:
25645.11
Organism:
Homo sapiens (Human)
Description:
P01375
Residue:
233
  
Inhibitor
Name:
BDBM65736
Synonyms:
7-[(E)-but-2-enyl]-8-[(4-chlorobenzyl)thio]-3-methyl-xanthine 7-[(E)-but-2-enyl]-8-[(4-chlorophenyl)methylsulfanyl]-3-methylpurine-2,6-dione MLS-0018272.0001 | cid_5761205
Type:
Small organic molecule
Emp. Form.:
C17H17ClN4O2S
Mol. Mass.:
376.86
SMILES:
C\C=C\Cn1c(SCc2ccc(Cl)cc2)nc2n(C)c(=O)[nH]c(=O)c12
: