Target
Tumor necrosis factor
Ligand
BDBM65737
Substrate
Meas. Tech.
SAR analysis of inhibitors of TNFa specific NF-kB induction - Set 2
IC50
>20000±n/a nM
Citation
 PubChem, PC SAR analysis of inhibitors of TNFa specific NF-kB induction - Set 2 PubChem Bioassay (2010)[AID] 
Target
Name:
Tumor necrosis factor
Synonyms:
Cachectin TNF-a TNFA TNFSF2 Tumor necrosis factor (TNFa) Tumor necrosis factor ligand superfamily member 2 Tumor necrosis factor, soluble form | tumor necrosis factor alpha
Type:
Enzyme
Mol. Mass.:
25645.11
Organism:
Homo sapiens (Human)
Description:
P01375
Residue:
233
  
Inhibitor
Name:
BDBM65737
Synonyms:
3-methyl-8-(3-phenylpropylsulfanyl)-7-propan-2-yl-purine-2,6-dione 3-methyl-8-(3-phenylpropylthio)-7-propan-2-ylpurine-2,6-dione MLS-0059529.0001 | cid_3111693
Type:
Small organic molecule
Emp. Form.:
C18H22N4O2S
Mol. Mass.:
358.458
SMILES:
CC(C)n1c(SCCCc2ccccc2)nc2n(C)c(=O)[nH]c(=O)c12
: