Target
Fatty acid synthase
Ligand
BDBM269337
Substrate
Meas. Tech.
Fatty Acid Synthase (FASN) Inhibition Scintillation Proximity Assay
pH
7.5±n/a
Temperature
298.15±n/a K
IC50
33.9±n/a nM
Comments
extracted
Citation
 Connolly, PJLu, T Imidazolin-5-one derivative useful as FASN inhibitors for the treatment of cancer US Patent  US9718813 Publication Date 8/1/2017 
Target
Name:
Fatty acid synthase
Synonyms:
FAS FAS_HUMAN HU FASN
Type:
Enzyme
Mol. Mass.:
273419.37
Organism:
Homo sapiens (Human)
Description:
P49327
Residue:
2511
  
Inhibitor
Name:
BDBM269337
Synonyms:
2-(4-(6-fluoronaphthalen-2-yl)-2-methylphenyl)-4,4-dimethyl-1-((1-(1-methylcyclopropanecarbonyl)azetidin-3-yl)methyl)-1H-imidazol-5(4H)-one US9718813, Compound 82
Type:
Small organic molecule
Emp. Form.:
C31H32FN3O2
Mol. Mass.:
497.6031
SMILES:
Cc1cc(ccc1C1=NC(C)(C)C(=O)N1CC1CN(C1)C(=O)C1(C)CC1)-c1ccc2cc(F)ccc2c1
: