Target
Bcl-2-like protein 11
Ligand
BDBM61049
Substrate
Meas. Tech.
Luminescence Cell-Based Dose Retest to Identify Inhibitors of A1 Apoptosis
EC50
9646±n/a nM
Citation
 PubChem, PC Luminescence Cell-Based Dose Retest to Identify Inhibitors of A1 Apoptosis PubChem Bioassay (2010)[AID] 
Target
Name:
Bcl-2-like protein 11
Synonyms:
B2L11_HUMAN BCL2L11 | BIM
Type:
PROTEIN
Mol. Mass.:
22175.26
Organism:
Homo sapiens (Human)
Description:
EBI_101325
Residue:
198
  
Inhibitor
Name:
BDBM61049
Synonyms:
MLS000569095 N-[4-(4-fluorophenyl)-1,3-thiazol-2-yl]-2-[(8-methoxy-4-methyl-[1,2,4]triazolo[4,3-a]quinolin-1-yl)sulfanyl]acetamide N-[4-(4-fluorophenyl)-2-thiazolyl]-2-[(8-methoxy-4-methyl-[1,2,4]triazolo[4,3-a]quinolin-1-yl)thio]acetamide SMR000172759 | cid_1172084
Type:
Small organic molecule
Emp. Form.:
C23H18FN5O2S2
Mol. Mass.:
479.55
SMILES:
COc1ccc2cc(C)c3nnc(SCC(=O)Nc4nc(cs4)-c4ccc(F)cc4)n3c2c1
: