Target
Bcl-2-like protein 11
Ligand
BDBM165
Substrate
Meas. Tech.
Luminescence Cell-Based Dose Retest to Identify Inhibitors of A1 Apoptosis
EC50
>350000±n/a nM
Citation
 PubChem, PC Luminescence Cell-Based Dose Retest to Identify Inhibitors of A1 Apoptosis PubChem Bioassay (2010)[AID] 
Target
Name:
Bcl-2-like protein 11
Synonyms:
B2L11_HUMAN BCL2L11 | BIM
Type:
PROTEIN
Mol. Mass.:
22175.26
Organism:
Homo sapiens (Human)
Description:
EBI_101325
Residue:
198
  
Inhibitor
Name:
BDBM165
Synonyms:
MLS002460463 cid_44143239 formic acid;1-[3-methyl-2-[2-(methylamino)propanoylamino]butanoyl]-N-tetralin-1-yl-pyrrolidine-2-carboxamide methanoic acid;1-[3-methyl-2-[2-(methylamino)propanoylamino]butanoyl]-N-(1,2,3,4-tetrahydronaphthalen-1-yl)pyrrolidine-2-carboxamide
Type:
Small organic molecule
Emp. Form.:
C24H36N4O3
Mol. Mass.:
428.5676
SMILES:
CNC(C)C(=O)NC(C(C)C)C(=O)N1CCCC1C(=O)NC1CCCc2ccccc12
: