Target
Bcl-2-like protein 11
Ligand
BDBM67063
Substrate
Meas. Tech.
Luminescence Cell-Based Dose Retest to Identify Inhibitors of A1 Apoptosis
EC50
>350000±n/a nM
Citation
 PubChem, PC Luminescence Cell-Based Dose Retest to Identify Inhibitors of A1 Apoptosis PubChem Bioassay (2010)[AID] 
Target
Name:
Bcl-2-like protein 11
Synonyms:
B2L11_HUMAN BCL2L11 | BIM
Type:
PROTEIN
Mol. Mass.:
22175.26
Organism:
Homo sapiens (Human)
Description:
EBI_101325
Residue:
198
  
Inhibitor
Name:
BDBM67063
Synonyms:
4-chloranyl-N-[(2R,3R)-3-methyl-2-[[methyl(pyridin-4-ylmethyl)amino]methyl]-6-oxidanylidene-5-[(2S)-1-oxidanylpropan-2-yl]-3,4-dihydro-2H-1,5-benzoxazocin-8-yl]benzenesulfonamide 4-chloro-N-[(2R,3R)-5-[(2S)-1-hydroxypropan-2-yl]-3-methyl-2-[[methyl(pyridin-4-ylmethyl)amino]methyl]-6-oxo-3,4-dihydro-2H-1,5-benzoxazocin-8-yl]benzenesulfonamide SMR001398624 | cid_44202688
Type:
Small organic molecule
Emp. Form.:
C28H33ClN4O5S
Mol. Mass.:
573.103
SMILES:
C[C@@H](CO)N1C[C@@H](C)[C@H](CN(C)Cc2ccncc2)Oc2ccc(NS(=O)(=O)c3ccc(Cl)cc3)cc2C1=O
: