Target
Bcl-2-like protein 11
Ligand
BDBM67066
Substrate
Meas. Tech.
Luminescence Cell-Based Dose Retest to Identify Inhibitors of A1 Apoptosis
EC50
>350000±n/a nM
Citation
 PubChem, PC Luminescence Cell-Based Dose Retest to Identify Inhibitors of A1 Apoptosis PubChem Bioassay (2010)[AID] 
Target
Name:
Bcl-2-like protein 11
Synonyms:
B2L11_HUMAN BCL2L11 | BIM
Type:
PROTEIN
Mol. Mass.:
22175.26
Organism:
Homo sapiens (Human)
Description:
EBI_101325
Residue:
198
  
Inhibitor
Name:
BDBM67066
Synonyms:
3-cyclohexyl-1-[[(2S,3S)-5-[(1R)-2-hydroxy-1-methyl-ethyl]-6-keto-3-methyl-10-[(1-methylimidazol-4-yl)sulfonylamino]-3,4-dihydro-2H-1,5-benzoxazocin-2-yl]methyl]-1-methyl-urea 3-cyclohexyl-1-[[(2S,3S)-5-[(2R)-1-hydroxypropan-2-yl]-3-methyl-10-[(1-methylimidazol-4-yl)sulfonylamino]-6-oxo-3,4-dihydro-2H-1,5-benzoxazocin-2-yl]methyl]-1-methylurea MLS002474221 cid_44202861
Type:
Small organic molecule
Emp. Form.:
C27H40N6O6S
Mol. Mass.:
576.708
SMILES:
C[C@H](CO)N1C[C@H](C)[C@@H](CN(C)C(=O)NC2CCCCC2)Oc2c(NS(=O)(=O)c3cn(C)cn3)cccc2C1=O
: