Target
Serine/threonine-protein kinase 33
Ligand
BDBM67636
Substrate
Meas. Tech.
Luminescence Cell-Free Homogenous Dose Retest to Identify Inhibitors of Serine/Threonine Kinase 33 Activity
EC50
86050±n/a nM
Citation
 PubChem, PC Luminescence Cell-Free Homogenous Dose Retest to Identify Inhibitors of Serine/Threonine Kinase 33 Activity PubChem Bioassay (2010)[AID] 
Target
Name:
Serine/threonine-protein kinase 33
Synonyms:
STK33 Serine/threonine-protein kinase 33
Type:
Enzyme Catalytic Domain
Mol. Mass.:
57833.21
Organism:
Homo sapiens (Human)
Description:
gi_23943882
Residue:
514
  
Inhibitor
Name:
BDBM67636
Synonyms:
5-bromanyl-3-(4-methoxyphenyl)-7-methyl-7-oxidanyl-isochromene-6,8-dione 5-bromo-7-hydroxy-3-(4-methoxyphenyl)-7-methyl-isochromene-6,8-quinone CMLD003390 SMR000452554 | cid_16745544
Type:
Small organic molecule
Emp. Form.:
C17H13BrO5
Mol. Mass.:
377.186
SMILES:
COc1ccc(cc1)C1=CC2=C(Br)C(=O)C(C)(O)C(=O)C2=CO1
: