Target
Methionine aminopeptidase 1
Ligand
BDBM68286
Substrate
Meas. Tech.
Enzymatic Assay
IC50
4.02e+4± 1.43e+4 nM
Citation
 Hu, XDang, YTenney, KCrews, PTsai, CWSixt, KMCole, PALiu, JO Regulation of c-Src nonreceptor tyrosine kinase activity by bengamide A through inhibition of methionine aminopeptidases. Chem Biol 14:764-74 (2007)  
Target
Name:
Methionine aminopeptidase 1
Synonyms:
Aminopeptidase MAP 1 METAP1 Methionine Aminopeptidase Type 1 (MetAP1) | Peptidase M 1
Type:
Enzyme
Mol. Mass.:
43220.79
Organism:
Homo sapiens (Human)
Description:
MetAP1 with an N-terminal six histidine tag was expressed in baculovirus infected sf9 cells.
Residue:
386
  
Inhibitor
Name:
BDBM68286
Synonyms:
Bengamide N | Bengamide O
Type:
Small organic molecule
Emp. Form.:
C32H58N2O8
Mol. Mass.:
598.8115
SMILES:
CO[C@H]([C@H](O)[C@@H](O)[C@H](O)\C=C\C(C)C)C(=O)NC1CCC(CN(C)C1=O)C(=O)OCCCCCCCCCCC(C)C
: