Target
Cannabinoid receptor 2
Ligand
BDBM61049
Substrate
Meas. Tech.
SAR analysis of antagonists of the Cannabinoid Receptor 2 using an Image-Based Assay - Set 2
IC50
>32000±n/a nM
Citation
 PubChem, PC SAR analysis of antagonists of the Cannabinoid Receptor 2 using an Image-Based Assay - Set 2 PubChem Bioassay (2010)[AID] 
Target
Name:
Cannabinoid receptor 2
Synonyms:
CANNABINOID CB2 CB2 CB2B CNR2_HUMAN Cannabinoid CB2 receptor Cannabinoid receptor 2 (CB2R) | hCB2
Type:
G Protein-Coupled Receptor (GPCR)
Mol. Mass.:
39690.94
Organism:
Homo sapiens (Human)
Description:
P34972
Residue:
360
  
Inhibitor
Name:
BDBM61049
Synonyms:
MLS000569095 N-[4-(4-fluorophenyl)-1,3-thiazol-2-yl]-2-[(8-methoxy-4-methyl-[1,2,4]triazolo[4,3-a]quinolin-1-yl)sulfanyl]acetamide N-[4-(4-fluorophenyl)-2-thiazolyl]-2-[(8-methoxy-4-methyl-[1,2,4]triazolo[4,3-a]quinolin-1-yl)thio]acetamide SMR000172759 | cid_1172084
Type:
Small organic molecule
Emp. Form.:
C23H18FN5O2S2
Mol. Mass.:
479.55
SMILES:
COc1ccc2cc(C)c3nnc(SCC(=O)Nc4nc(cs4)-c4ccc(F)cc4)n3c2c1
: