Target
Cannabinoid receptor 2
Ligand
BDBM61094
Substrate
Meas. Tech.
SAR analysis of antagonists of the Cannabinoid Receptor 2 using an Image-Based Assay - Set 2
IC50
>32000±n/a nM
Citation
 PubChem, PC SAR analysis of antagonists of the Cannabinoid Receptor 2 using an Image-Based Assay - Set 2 PubChem Bioassay (2010)[AID] 
Target
Name:
Cannabinoid receptor 2
Synonyms:
CANNABINOID CB2 CB2 CB2B CNR2_HUMAN Cannabinoid CB2 receptor Cannabinoid receptor 2 (CB2R) | hCB2
Type:
G Protein-Coupled Receptor (GPCR)
Mol. Mass.:
39690.94
Organism:
Homo sapiens (Human)
Description:
P34972
Residue:
360
  
Inhibitor
Name:
BDBM61094
Synonyms:
MLS000760658 N,N-dimethyl-3-[4-(4-nitrophenyl)piperazine-1-carbonyl]-4-pyrrolidin-1-ylbenzenesulfonamide N,N-dimethyl-3-[[4-(4-nitrophenyl)-1-piperazinyl]-oxomethyl]-4-(1-pyrrolidinyl)benzenesulfonamide cid_4832119
Type:
Small organic molecule
Emp. Form.:
C23H29N5O5S
Mol. Mass.:
487.572
SMILES:
CN(C)S(=O)(=O)c1ccc(N2CCCC2)c(c1)C(=O)N1CCN(CC1)c1ccc(cc1)[N+]([O-])=O
: