Target
Cannabinoid receptor 2
Ligand
BDBM68301
Substrate
Meas. Tech.
SAR analysis of antagonists of the Cannabinoid Receptor 2 using an Image-Based Assay - Set 2
IC50
>32000±n/a nM
Citation
 PubChem, PC SAR analysis of antagonists of the Cannabinoid Receptor 2 using an Image-Based Assay - Set 2 PubChem Bioassay (2010)[AID] 
Target
Name:
Cannabinoid receptor 2
Synonyms:
CANNABINOID CB2 CB2 CB2B CNR2_HUMAN Cannabinoid CB2 receptor Cannabinoid receptor 2 (CB2R) | hCB2
Type:
G Protein-Coupled Receptor (GPCR)
Mol. Mass.:
39690.94
Organism:
Homo sapiens (Human)
Description:
P34972
Residue:
360
  
Inhibitor
Name:
BDBM68301
Synonyms:
4-(difluoromethoxy)-N-(2-methoxy-5-morpholin-4-ylsulfonylphenyl)benzamide 4-(difluoromethoxy)-N-[2-methoxy-5-(4-morpholinylsulfonyl)phenyl]benzamide MLS-0405205.0001 | cid_4676506
Type:
Small organic molecule
Emp. Form.:
C19H20F2N2O6S
Mol. Mass.:
442.434
SMILES:
COc1ccc(cc1NC(=O)c1ccc(OC(F)F)cc1)S(=O)(=O)N1CCOCC1
: