Target
Cannabinoid receptor 2
Ligand
BDBM68314
Substrate
Meas. Tech.
SAR analysis of antagonists of the Cannabinoid Receptor 2 using an Image-Based Assay - Set 2
IC50
>32000±n/a nM
Citation
 PubChem, PC SAR analysis of antagonists of the Cannabinoid Receptor 2 using an Image-Based Assay - Set 2 PubChem Bioassay (2010)[AID] 
Target
Name:
Cannabinoid receptor 2
Synonyms:
CANNABINOID CB2 CB2 CB2B CNR2_HUMAN Cannabinoid CB2 receptor Cannabinoid receptor 2 (CB2R) | hCB2
Type:
G Protein-Coupled Receptor (GPCR)
Mol. Mass.:
39690.94
Organism:
Homo sapiens (Human)
Description:
P34972
Residue:
360
  
Inhibitor
Name:
BDBM68314
Synonyms:
MLS-0435540.0001 [4-(2-methylphenyl)piperazin-1-yl]-(5-piperidin-1-ylsulfonyl-2-pyrrolidin-1-yl-phenyl)methanone [4-(o-tolyl)piperazino]-(5-piperidinosulfonyl-2-pyrrolidino-phenyl)methanone | cid_17563969
Type:
Small organic molecule
Emp. Form.:
C27H36N4O3S
Mol. Mass.:
496.665
SMILES:
Cc1ccccc1N1CCN(CC1)C(=O)c1cc(ccc1N1CCCC1)S(=O)(=O)N1CCCCC1
: