Target
Cannabinoid receptor 2
Ligand
BDBM68318
Substrate
Meas. Tech.
SAR analysis of antagonists of the Cannabinoid Receptor 2 using an Image-Based Assay - Set 2
IC50
>32000±n/a nM
Citation
 PubChem, PC SAR analysis of antagonists of the Cannabinoid Receptor 2 using an Image-Based Assay - Set 2 PubChem Bioassay (2010)[AID] 
Target
Name:
Cannabinoid receptor 2
Synonyms:
CANNABINOID CB2 CB2 CB2B CNR2_HUMAN Cannabinoid CB2 receptor Cannabinoid receptor 2 (CB2R) | hCB2
Type:
G Protein-Coupled Receptor (GPCR)
Mol. Mass.:
39690.94
Organism:
Homo sapiens (Human)
Description:
P34972
Residue:
360
  
Inhibitor
Name:
BDBM68318
Synonyms:
MLS-0401659.0001 N-(2-ethoxy-5-morpholin-4-ylsulfonylphenyl)-4-(2-oxopyrrolidin-1-yl)benzamide N-[2-ethoxy-5-(4-morpholinylsulfonyl)phenyl]-4-(2-oxo-1-pyrrolidinyl)benzamide | cid_24978834
Type:
Small organic molecule
Emp. Form.:
C23H27N3O6S
Mol. Mass.:
473.542
SMILES:
CCOc1ccc(cc1NC(=O)c1ccc(cc1)N1CCCC1=O)S(=O)(=O)N1CCOCC1
: