Target
Cannabinoid receptor 2
Ligand
BDBM68327
Substrate
Meas. Tech.
SAR analysis of antagonists of the Cannabinoid Receptor 2 using an Image-Based Assay - Set 2
IC50
>32000±n/a nM
Citation
 PubChem, PC SAR analysis of antagonists of the Cannabinoid Receptor 2 using an Image-Based Assay - Set 2 PubChem Bioassay (2010)[AID] 
Target
Name:
Cannabinoid receptor 2
Synonyms:
CANNABINOID CB2 CB2 CB2B CNR2_HUMAN Cannabinoid CB2 receptor Cannabinoid receptor 2 (CB2R) | hCB2
Type:
G Protein-Coupled Receptor (GPCR)
Mol. Mass.:
39690.94
Organism:
Homo sapiens (Human)
Description:
P34972
Residue:
360
  
Inhibitor
Name:
BDBM68327
Synonyms:
MLS-0435557.0001 | cid_3190055
Type:
Small organic molecule
Emp. Form.:
C24H19N5O4S2
Mol. Mass.:
505.569
SMILES:
COc1ccc(cc1)-c1csc(NC(=O)CSc2nnc3c(C)cc4cc5OCOc5cc4n23)n1
: