Target
G-protein coupled receptor 35
Ligand
BDBM68318
Substrate
Meas. Tech.
SAR analysis of Agonists of the GPR35 Receptor using an Image-Based Assay - Set 3
EC50
>32000±n/a nM
Citation
 PubChem, PC SAR analysis of Agonists of the GPR35 Receptor using an Image-Based Assay - Set 3 PubChem Bioassay (2010)[AID] 
Target
Name:
G-protein coupled receptor 35
Synonyms:
G protein-coupled receptor 35 GPR35_HUMAN
Type:
Enzyme Catalytic Domain
Mol. Mass.:
34085.57
Organism:
Homo sapiens (Human)
Description:
gi_33695097
Residue:
309
  
Inhibitor
Name:
BDBM68318
Synonyms:
MLS-0401659.0001 N-(2-ethoxy-5-morpholin-4-ylsulfonylphenyl)-4-(2-oxopyrrolidin-1-yl)benzamide N-[2-ethoxy-5-(4-morpholinylsulfonyl)phenyl]-4-(2-oxo-1-pyrrolidinyl)benzamide | cid_24978834
Type:
Small organic molecule
Emp. Form.:
C23H27N3O6S
Mol. Mass.:
473.542
SMILES:
CCOc1ccc(cc1NC(=O)c1ccc(cc1)N1CCCC1=O)S(=O)(=O)N1CCOCC1
: