Target
G-protein coupled receptor 35
Ligand
BDBM68292
Substrate
Meas. Tech.
SAR analysis of Antagonists of the GPR35 Receptor using an Image-Based Assay - Set 4
IC50
>32000±n/a nM
Citation
 PubChem, PC SAR analysis of Antagonists of the GPR35 Receptor using an Image-Based Assay - Set 4 PubChem Bioassay (2010)[AID] 
Target
Name:
G-protein coupled receptor 35
Synonyms:
G protein-coupled receptor 35 GPR35_HUMAN
Type:
Enzyme Catalytic Domain
Mol. Mass.:
34085.57
Organism:
Homo sapiens (Human)
Description:
gi_33695097
Residue:
309
  
Inhibitor
Name:
BDBM68292
Synonyms:
MLS-0435525.0001 N-(2-chloro-5-morpholin-4-ylsulfonylphenyl)-4,5,6,7-tetrahydro-1-benzothiophene-2-carboxamide N-[2-chloro-5-(4-morpholinylsulfonyl)phenyl]-4,5,6,7-tetrahydro-1-benzothiophene-2-carboxamide | cid_3886815
Type:
Small organic molecule
Emp. Form.:
C19H21ClN2O4S2
Mol. Mass.:
440.964
SMILES:
Clc1ccc(cc1NC(=O)c1cc2CCCCc2s1)S(=O)(=O)N1CCOCC1
: