Target
G-protein coupled receptor 35
Ligand
BDBM68299
Substrate
Meas. Tech.
SAR analysis of Antagonists of the GPR35 Receptor using an Image-Based Assay - Set 4
IC50
>32000±n/a nM
Citation
 PubChem, PC SAR analysis of Antagonists of the GPR35 Receptor using an Image-Based Assay - Set 4 PubChem Bioassay (2010)[AID] 
Target
Name:
G-protein coupled receptor 35
Synonyms:
G protein-coupled receptor 35 GPR35_HUMAN
Type:
Enzyme Catalytic Domain
Mol. Mass.:
34085.57
Organism:
Homo sapiens (Human)
Description:
gi_33695097
Residue:
309
  
Inhibitor
Name:
BDBM68299
Synonyms:
MLS-0435528.0001 N,N-dimethyl-3-(4-phenylpiperazine-1-carbonyl)-4-pyrrolidin-1-ylbenzenesulfonamide N,N-dimethyl-3-[oxo-(4-phenyl-1-piperazinyl)methyl]-4-(1-pyrrolidinyl)benzenesulfonamide | cid_2466259
Type:
Small organic molecule
Emp. Form.:
C23H30N4O3S
Mol. Mass.:
442.574
SMILES:
CN(C)S(=O)(=O)c1ccc(N2CCCC2)c(c1)C(=O)N1CCN(CC1)c1ccccc1
: