Target
G-protein coupled receptor 35
Ligand
BDBM68321
Substrate
Meas. Tech.
SAR analysis of Antagonists of the GPR35 Receptor using an Image-Based Assay - Set 4
IC50
>32000±n/a nM
Citation
 PubChem, PC SAR analysis of Antagonists of the GPR35 Receptor using an Image-Based Assay - Set 4 PubChem Bioassay (2010)[AID] 
Target
Name:
G-protein coupled receptor 35
Synonyms:
G protein-coupled receptor 35 GPR35_HUMAN
Type:
Enzyme Catalytic Domain
Mol. Mass.:
34085.57
Organism:
Homo sapiens (Human)
Description:
gi_33695097
Residue:
309
  
Inhibitor
Name:
BDBM68321
Synonyms:
4-ethyl-N-(2-methoxy-5-morpholin-4-ylsulfonyl-phenyl)-5-methyl-thiophene-2-carboxamide 4-ethyl-N-(2-methoxy-5-morpholinosulfonyl-phenyl)-5-methyl-thiophene-2-carboxamide MLS-0435544.0001 | cid_26848739
Type:
Small organic molecule
Emp. Form.:
C19H24N2O5S2
Mol. Mass.:
424.534
SMILES:
CCc1cc(sc1C)C(=O)Nc1cc(ccc1OC)S(=O)(=O)N1CCOCC1
: