Target
Cannabinoid receptor 2
Ligand
BDBM68295
Substrate
Meas. Tech.
SAR analysis of agonists of the Cannabinoid Receptor 2 using an Image-Based Assay - Set 2
EC50
>32000±n/a nM
Citation
 PubChem, PC SAR analysis of agonists of the Cannabinoid Receptor 2 using an Image-Based Assay - Set 2 PubChem Bioassay (2010)[AID] 
Target
Name:
Cannabinoid receptor 2
Synonyms:
CANNABINOID CB2 CB2 CB2B CNR2_HUMAN Cannabinoid CB2 receptor Cannabinoid receptor 2 (CB2R) | hCB2
Type:
G Protein-Coupled Receptor (GPCR)
Mol. Mass.:
39690.94
Organism:
Homo sapiens (Human)
Description:
P34972
Residue:
360
  
Inhibitor
Name:
BDBM68295
Synonyms:
MLS-0413566.0001 N-(2-methoxy-5-morpholin-4-ylsulfonylphenyl)-1,3-benzodioxole-5-carboxamide N-[2-methoxy-5-(4-morpholinylsulfonyl)phenyl]-1,3-benzodioxole-5-carboxamide | cid_3921758
Type:
Small organic molecule
Emp. Form.:
C19H20N2O7S
Mol. Mass.:
420.436
SMILES:
COc1ccc(cc1NC(=O)c1ccc2OCOc2c1)S(=O)(=O)N1CCOCC1
: