Target
Cannabinoid receptor 2
Ligand
BDBM68312
Substrate
Meas. Tech.
SAR analysis of agonists of the Cannabinoid Receptor 2 using an Image-Based Assay - Set 2
EC50
>32000±n/a nM
Citation
 PubChem, PC SAR analysis of agonists of the Cannabinoid Receptor 2 using an Image-Based Assay - Set 2 PubChem Bioassay (2010)[AID] 
Target
Name:
Cannabinoid receptor 2
Synonyms:
CANNABINOID CB2 CB2 CB2B CNR2_HUMAN Cannabinoid CB2 receptor Cannabinoid receptor 2 (CB2R) | hCB2
Type:
G Protein-Coupled Receptor (GPCR)
Mol. Mass.:
39690.94
Organism:
Homo sapiens (Human)
Description:
P34972
Residue:
360
  
Inhibitor
Name:
BDBM68312
Synonyms:
4-fluoranyl-N-(2-methoxy-5-morpholin-4-ylsulfonyl-phenyl)-3-methyl-1-benzothiophene-2-carboxamide 4-fluoro-N-(2-methoxy-5-morpholinosulfonyl-phenyl)-3-methyl-benzothiophene-2-carboxamide MLS-0435538.0001 | cid_16303023
Type:
Small organic molecule
Emp. Form.:
C21H21FN2O5S2
Mol. Mass.:
464.53
SMILES:
COc1ccc(cc1NC(=O)c1sc2cccc(F)c2c1C)S(=O)(=O)N1CCOCC1
: