Target
Cannabinoid receptor 1
Ligand
BDBM68293
Substrate
Meas. Tech.
SAR analysis of antagonists of the Cannabinoid Receptor 1 using an Image-Based Assay - Set 3
IC50
>32000±n/a nM
Citation
 PubChem, PC SAR analysis of antagonists of the Cannabinoid Receptor 1 using an Image-Based Assay - Set 3 PubChem Bioassay (2010)[AID] 
Target
Name:
Cannabinoid receptor 1
Synonyms:
CANN6 CB-R CNR CNR1_HUMAN Cannabinoid receptor Cannabinoid receptor 1 (brain)
Type:
G Protein-Coupled Receptor (GPCR)
Mol. Mass.:
52868.96
Organism:
Homo sapiens (Human)
Description:
P21554
Residue:
472
  
Inhibitor
Name:
BDBM68293
Synonyms:
3-[4-(2,3-dimethylphenyl)piperazin-1-yl]carbonyl-N,N-dimethyl-benzenesulfonamide 3-[4-(2,3-dimethylphenyl)piperazine-1-carbonyl]-N,N-dimethylbenzenesulfonamide MLS-0435526.0001 | cid_2090194
Type:
Small organic molecule
Emp. Form.:
C21H27N3O3S
Mol. Mass.:
401.522
SMILES:
CN(C)S(=O)(=O)c1cccc(c1)C(=O)N1CCN(CC1)c1cccc(C)c1C
: