Target
Cannabinoid receptor 1
Ligand
BDBM68296
Substrate
Meas. Tech.
SAR analysis of antagonists of the Cannabinoid Receptor 1 using an Image-Based Assay - Set 3
IC50
>32000±n/a nM
Citation
 PubChem, PC SAR analysis of antagonists of the Cannabinoid Receptor 1 using an Image-Based Assay - Set 3 PubChem Bioassay (2010)[AID] 
Target
Name:
Cannabinoid receptor 1
Synonyms:
CANN6 CB-R CNR CNR1_HUMAN Cannabinoid receptor Cannabinoid receptor 1 (brain)
Type:
G Protein-Coupled Receptor (GPCR)
Mol. Mass.:
52868.96
Organism:
Homo sapiens (Human)
Description:
P21554
Residue:
472
  
Inhibitor
Name:
BDBM68296
Synonyms:
4-chloranyl-N,N-dimethyl-3-[4-(4-nitrophenyl)piperazin-1-yl]carbonyl-benzenesulfonamide 4-chloro-N,N-dimethyl-3-[[4-(4-nitrophenyl)-1-piperazinyl]-oxomethyl]benzenesulfonamide cid_3504306
Type:
Small organic molecule
Emp. Form.:
C19H21ClN4O5S
Mol. Mass.:
452.912
SMILES:
CN(C)S(=O)(=O)c1ccc(Cl)c(c1)C(=O)N1CCN(CC1)c1ccc(cc1)[N+]([O-])=O
: