Target
Cannabinoid receptor 1
Ligand
BDBM68303
Substrate
Meas. Tech.
SAR analysis of antagonists of the Cannabinoid Receptor 1 using an Image-Based Assay - Set 3
IC50
>32000±n/a nM
Citation
 PubChem, PC SAR analysis of antagonists of the Cannabinoid Receptor 1 using an Image-Based Assay - Set 3 PubChem Bioassay (2010)[AID] 
Target
Name:
Cannabinoid receptor 1
Synonyms:
CANN6 CB-R CNR CNR1_HUMAN Cannabinoid receptor Cannabinoid receptor 1 (brain)
Type:
G Protein-Coupled Receptor (GPCR)
Mol. Mass.:
52868.96
Organism:
Homo sapiens (Human)
Description:
P21554
Residue:
472
  
Inhibitor
Name:
BDBM68303
Synonyms:
3-methoxy-N-(2-methoxy-5-morpholin-4-ylsulfonyl-phenyl)-4-(2-methylpropoxy)benzamide 3-methoxy-N-[2-methoxy-5-(4-morpholinylsulfonyl)phenyl]-4-(2-methylpropoxy)benzamide MLS-0413763.0001 | cid_16250706
Type:
Small organic molecule
Emp. Form.:
C23H30N2O7S
Mol. Mass.:
478.559
SMILES:
COc1ccc(cc1NC(=O)c1ccc(OCC(C)C)c(OC)c1)S(=O)(=O)N1CCOCC1
: