Target
Cannabinoid receptor 1
Ligand
BDBM68324
Substrate
Meas. Tech.
SAR analysis of antagonists of the Cannabinoid Receptor 1 using an Image-Based Assay - Set 3
IC50
12700±n/a nM
Citation
 PubChem, PC SAR analysis of antagonists of the Cannabinoid Receptor 1 using an Image-Based Assay - Set 3 PubChem Bioassay (2010)[AID] 
Target
Name:
Cannabinoid receptor 1
Synonyms:
CANN6 CB-R CNR CNR1_HUMAN Cannabinoid receptor Cannabinoid receptor 1 (brain)
Type:
G Protein-Coupled Receptor (GPCR)
Mol. Mass.:
52868.96
Organism:
Homo sapiens (Human)
Description:
P21554
Residue:
472
  
Inhibitor
Name:
BDBM68324
Synonyms:
MLS-0435554.0001 | cid_1135867
Type:
Small organic molecule
Emp. Form.:
C24H19N5O3S2
Mol. Mass.:
489.569
SMILES:
Cc1cc2cc3OCCOc3cc2n2c(SCC(=O)Nc3nc(cs3)-c3ccccc3)nnc12
: