Target
Alkanal monooxygenase alpha chain
Ligand
BDBM65981
Substrate
Meas. Tech.
Absorbance Microorganism Dose Response to Identify Inhibitors of Vibrio harveyi
EC50
>160000±n/a nM
Citation
 PubChem, PC Absorbance Microorganism Dose Response to Identify Inhibitors of Vibrio harveyi PubChem Bioassay (2010)[AID] 
Target
Name:
Alkanal monooxygenase alpha chain
Synonyms:
Bacterial luciferase alpha chain luxA
Type:
Enzyme Catalytic Domain
Mol. Mass.:
40139.12
Organism:
Vibrio harveyi
Description:
gi_126509
Residue:
355
  
Inhibitor
Name:
BDBM65981
Synonyms:
MLS001176288 N-(4-fluorophenyl)sulfonyl-N-methyl-4-propylbenzenesulfonamide cid_8933071
Type:
Small organic molecule
Emp. Form.:
C16H18FNO4S2
Mol. Mass.:
371.447
SMILES:
CCCc1ccc(cc1)S(=O)(=O)N(C)S(=O)(=O)c1ccc(F)cc1
: