Target
Protein RecA
Ligand
BDBM31772
Substrate
Meas. Tech.
Fluorescence Cell-Free Homogeneous Counter Screen to Identify Inhibitors of GFP Chromophore Formation
EC50
23610±n/a nM
Citation
 PubChem, PC Fluorescence Cell-Free Homogeneous Counter Screen to Identify Inhibitors of GFP Chromophore Formation PubChem Bioassay (2010)[AID] 
Target
Name:
Protein RecA
Synonyms:
DNA recombination protein RecA recA
Type:
Enzyme Catalytic Domain
Mol. Mass.:
85386.52
Organism:
Mycobacterium tuberculosis H37Rv
Description:
gi_15609874
Residue:
790
  
Inhibitor
Name:
BDBM31772
Synonyms:
1-[2-(2,4-dichlorobenzyl)oxy-2-(2,4-dichlorophenyl)ethyl]imidazole;nitric acid CHEMBL91 Miconazole US9144538, Miconazole Nitrate | cid_4189
Type:
Small organic molecule
Emp. Form.:
C18H14Cl4N2O
Mol. Mass.:
416.129
SMILES:
Clc1ccc(COC(Cn2ccnc2)c2ccc(Cl)cc2Cl)c(Cl)c1
: