Target
Heat shock factor protein 1
Ligand
BDBM72848
Substrate
Meas. Tech.
Luminescence Cell-Based Dose Retest to Identify Potentiators of Heat Shock Factor 1 (HSF1)
EC50
>260000±n/a nM
Citation
 PubChem, PC Luminescence Cell-Based Dose Retest to Identify Potentiators of Heat Shock Factor 1 (HSF1) PubChem Bioassay (2010)[AID] 
Target
Name:
Heat shock factor protein 1
Synonyms:
HSF1_MOUSE Hsf1 protein
Type:
Enzyme Catalytic Domain
Mol. Mass.:
57208.68
Organism:
Mus musculus
Description:
P38532
Residue:
525
  
Inhibitor
Name:
BDBM72848
Synonyms:
(E)-3-[2-(1-azepanyl)-9-methyl-4-oxo-3-pyrido[1,2-a]pyrimidinyl]-2-cyano-2-propenoic acid methyl ester MLS001214709 cid_1850202 methyl (E)-3-[2-(azepan-1-yl)-9-methyl-4-oxopyrido[1,2-a]pyrimidin-3-yl]-2-cyanoprop-2-enoate
Type:
Small organic molecule
Emp. Form.:
C20H22N4O3
Mol. Mass.:
366.4137
SMILES:
COC(=O)C(=C\c1c(nc2c(C)cccn2c1=O)N1CCCCCC1)\C#N
: