Target
Protein LANA1
Ligand
BDBM74280
Substrate
Meas. Tech.
Fluorescence Polarization Cell-Free Homogeneous Dose Retest to Confirm Inhibitors of the LANA Histone H2A/H2B Interaction
EC50
>75000±n/a nM
Citation
 PubChem, PC Fluorescence Polarization Cell-Free Homogeneous Dose Retest to Confirm Inhibitors of the LANA Histone H2A/H2B Interaction PubChem Bioassay (2010)[AID] 
Target
Name:
Protein LANA1
Synonyms:
LANA LANA1_HHV8P
Type:
Enzyme Catalytic Domain
Mol. Mass.:
131093.36
Organism:
Human herpesvirus 8
Description:
Q9QR71
Residue:
1129
  
Inhibitor
Name:
BDBM74280
Synonyms:
MLS002166859 N-(2,4-dichlorophenyl)-2-(5-morpholin-4-ylsulfonylpyridin-2-yl)sulfanylpropanamide N-(2,4-dichlorophenyl)-2-[[5-(4-morpholinylsulfonyl)-2-pyridinyl]thio]propanamide cid_16329757
Type:
Small organic molecule
Emp. Form.:
C18H19Cl2N3O4S2
Mol. Mass.:
476.397
SMILES:
CC(Sc1ccc(cn1)S(=O)(=O)N1CCOCC1)C(=O)Nc1ccc(Cl)cc1Cl
: