Target
Protein LANA1
Ligand
BDBM74288
Substrate
Meas. Tech.
Fluorescence Polarization Cell-Free Homogeneous Dose Retest to Confirm Inhibitors of the LANA Histone H2A/H2B Interaction
EC50
>75000±n/a nM
Citation
 PubChem, PC Fluorescence Polarization Cell-Free Homogeneous Dose Retest to Confirm Inhibitors of the LANA Histone H2A/H2B Interaction PubChem Bioassay (2010)[AID] 
Target
Name:
Protein LANA1
Synonyms:
LANA LANA1_HHV8P
Type:
Enzyme Catalytic Domain
Mol. Mass.:
131093.36
Organism:
Human herpesvirus 8
Description:
Q9QR71
Residue:
1129
  
Inhibitor
Name:
BDBM74288
Synonyms:
1-(2,3-dihydro-1,4-benzodioxin-6-ylsulfonyl)-N-(2-pyridinyl)-4-piperidinecarboxamide 1-(2,3-dihydro-1,4-benzodioxin-6-ylsulfonyl)-N-pyridin-2-yl-piperidine-4-carboxamide MLS002179760 cid_18107099
Type:
Small organic molecule
Emp. Form.:
C19H21N3O5S
Mol. Mass.:
403.452
SMILES:
O=C(Nc1ccccn1)C1CCN(CC1)S(=O)(=O)c1ccc2OCCOc2c1
: