Target
Protein LANA1
Ligand
BDBM74294
Substrate
Meas. Tech.
Fluorescence Polarization Cell-Free Homogeneous Dose Retest to Confirm Inhibitors of the LANA Histone H2A/H2B Interaction
EC50
>75000±n/a nM
Citation
 PubChem, PC Fluorescence Polarization Cell-Free Homogeneous Dose Retest to Confirm Inhibitors of the LANA Histone H2A/H2B Interaction PubChem Bioassay (2010)[AID] 
Target
Name:
Protein LANA1
Synonyms:
LANA LANA1_HHV8P
Type:
Enzyme Catalytic Domain
Mol. Mass.:
131093.36
Organism:
Human herpesvirus 8
Description:
Q9QR71
Residue:
1129
  
Inhibitor
Name:
BDBM74294
Synonyms:
5-methoxy-3-methyl-N-(4-methyl-1,3-thiazol-2-yl)-1-benzofuran-2-carboxamide 5-methoxy-3-methyl-N-(4-methylthiazol-2-yl)coumarilamide SMR001270703 | cid_7770827
Type:
Small organic molecule
Emp. Form.:
C15H14N2O3S
Mol. Mass.:
302.348
SMILES:
COc1ccc2oc(C(=O)Nc3nc(C)cs3)c(C)c2c1
: