Target
Importin subunit alpha-1
Ligand
BDBM51581
Substrate
Meas. Tech.
Fluorescence Cell-Free Homogeneous Counterscreen to Identify Inhibitors of the RanGTP-Importin-beta complex.
EC50
27800±n/a nM
Citation
 PubChem, PC Fluorescence Cell-Free Homogeneous Counterscreen to Identify Inhibitors of the RanGTP-Importin-beta complex. PubChem Bioassay (2010)[AID] 
Target
Name:
Importin subunit alpha-1
Synonyms:
IMA1_HUMAN RCH1 karyopherin alpha 2 (RAG cohort 1, importin alpha 1), isoform CRA_b
Type:
Enzyme Catalytic Domain
Mol. Mass.:
57852.15
Organism:
Homo sapiens (Human)
Description:
gi_119609447
Residue:
529
  
Inhibitor
Name:
BDBM51581
Synonyms:
4-butyl-6-chloranyl-7-oxidanyl-8-(pyrrolidin-1-ylmethyl)chromen-2-one 4-butyl-6-chloro-7-hydroxy-8-(1-pyrrolidinylmethyl)-2H-chromen-2-one 4-butyl-6-chloro-7-hydroxy-8-(pyrrolidinomethyl)coumarin SMR000076840 | cid_5622697
Type:
Small organic molecule
Emp. Form.:
C18H22ClNO3
Mol. Mass.:
335.825
SMILES:
CCCCc1cc(=O)oc2c(CN3CCCC3)c(O)c(Cl)cc12
: