Target
Importin subunit alpha-1
Ligand
BDBM75121
Substrate
Meas. Tech.
Fluorescence Cell-Free Homogeneous Counterscreen to Identify Inhibitors of the RanGTP-Importin-beta complex.
EC50
>500000±n/a nM
Citation
 PubChem, PC Fluorescence Cell-Free Homogeneous Counterscreen to Identify Inhibitors of the RanGTP-Importin-beta complex. PubChem Bioassay (2010)[AID] 
Target
Name:
Importin subunit alpha-1
Synonyms:
IMA1_HUMAN RCH1 karyopherin alpha 2 (RAG cohort 1, importin alpha 1), isoform CRA_b
Type:
Enzyme Catalytic Domain
Mol. Mass.:
57852.15
Organism:
Homo sapiens (Human)
Description:
gi_119609447
Residue:
529
  
Inhibitor
Name:
BDBM75121
Synonyms:
5-(2,4-dimethylphenyl)-7-phenyl-1,7-dihydro-[1,2,4]triazolo[1,5-a]pyrimidine SMR000472249 | cid_16738672
Type:
Small organic molecule
Emp. Form.:
C19H18N4
Mol. Mass.:
302.373
SMILES:
Cc1ccc(C2=Nc3ncnn3C(C2)c2ccccc2)c(C)c1
: