Target
Tyrosine-protein phosphatase non-receptor type 7
Ligand
BDBM48813
Substrate
Meas. Tech.
SAR analysis of compounds that inhibit HePTP - Set 2
IC50
331±n/a nM
Citation
 PubChem, PC SAR analysis of compounds that inhibit HePTP - Set 2 PubChem Bioassay (2010)[AID] 
Target
Name:
Tyrosine-protein phosphatase non-receptor type 7
Synonyms:
He-PTP Hematopoietic protein-tyrosine phosphatase (HEPTP) PTPN7 Tyrosine-protein phosphatase non-receptor type 7 | Tyrosine-protein phosphatase non-receptor type 7 (HEPTP)
Type:
Protein
Mol. Mass.:
40530.79
Organism:
Homo sapiens (Human)
Description:
P35236
Residue:
360
  
Inhibitor
Name:
BDBM48813
Synonyms:
2-chloranyl-5-[5-[(Z)-[3-[(4-methoxyphenyl)methyl]-4-oxidanylidene-2-sulfanylidene-1,3-thiazolidin-5-ylidene]methyl]furan-2-yl]benzoic acid 2-chloro-5-[5-[(Z)-(4-keto-3-p-anisyl-2-thioxo-thiazolidin-5-ylidene)methyl]-2-furyl]benzoic acid 2-chloro-5-[5-[(Z)-[3-[(4-methoxyphenyl)methyl]-4-oxo-2-sulfanylidene-5-thiazolidinylidene]methyl]-2-furanyl]benzoic acid SMR000298745 | cid_2285453
Type:
Small organic molecule
Emp. Form.:
C23H16ClNO5S2
Mol. Mass.:
485.96
SMILES:
COc1ccc(CN2C(=S)S\C(=C/c3ccc(o3)-c3ccc(Cl)c(c3)C(O)=O)C2=O)cc1
: