Target
Beta-galactosidase
Ligand
BDBM67287
Substrate
Meas. Tech.
HTS Dose response counterscreen for assays utilizing the enzyme, beta-galactosidase - Set 2
EC50
24807±n/a nM
Citation
 PubChem, PC HTS Dose response counterscreen for assays utilizing the enzyme, beta-galactosidase - Set 2 PubChem Bioassay (2010)[AID] 
Target
Name:
Beta-galactosidase
Synonyms:
BGAL_ECOLX Lactase | lacZ
Type:
PROTEIN
Mol. Mass.:
116943.87
Organism:
Escherichia coli
Description:
ChEMBL_215882
Residue:
1029
  
Inhibitor
Name:
BDBM67287
Synonyms:
MLS000770828 N-(2-chloro-5-nitro-phenyl)-2-(diethylamino)-4-methyl-thiazole-5-carbothioamide N-(2-chloro-5-nitrophenyl)-2-(diethylamino)-4-methyl-5-thiazolecarbothioamide cid_2100716
Type:
Small organic molecule
Emp. Form.:
C15H17ClN4O2S2
Mol. Mass.:
384.904
SMILES:
CCN(CC)c1nc(C)c(s1)C(=S)Nc1cc(ccc1Cl)[N+]([O-])=O
: