Target
Intestinal-type alkaline phosphatase 1
Ligand
BDBM34745
Substrate
Meas. Tech.
Dose Response confirmation of uHTS hits from a small molecule inhibitors of mouse intestinal alkaline phosphatase via a luminescent assay
IC50
1510±n/a nM
Citation
 PubChem, PC Dose Response confirmation of uHTS hits from a small molecule inhibitors of mouse intestinal alkaline phosphatase via a luminescent assay PubChem Bioassay (2010)[AID] 
Target
Name:
Intestinal-type alkaline phosphatase 1
Synonyms:
Alpi | PPBI1_RAT
Type:
Enzyme Catalytic Domain
Mol. Mass.:
58396.39
Organism:
Rattus norvegicus (Rat)
Description:
P15693
Residue:
540
  
Inhibitor
Name:
BDBM34745
Synonyms:
(4Z)-4-[[2-(2,6-dipyrrolidin-1-ylpyrimidin-4-yl)hydrazinyl]methylidene]-2-hydroxycyclohexa-2,5-dien-1-one (4Z)-4-[[N'-(2,6-dipyrrolidinopyrimidin-4-yl)hydrazino]methylene]-2-hydroxy-cyclohexa-2,5-dien-1-one 4-[(2,6-Di-pyrrolidin-1-yl-pyrimidin-4-yl)-hydrazonomethyl]-benzene-1,2-diol SMR000172266 | cid_5340492
Type:
Small organic molecule
Emp. Form.:
C19H24N6O2
Mol. Mass.:
368.4329
SMILES:
Oc1ccc(CN=Nc2cc(nc(n2)N2CCCC2)N2CCCC2)cc1O
: