Target
Intestinal-type alkaline phosphatase 1
Ligand
BDBM58703
Substrate
Meas. Tech.
Dose Response confirmation of uHTS hits from a small molecule inhibitors of mouse intestinal alkaline phosphatase via a luminescent assay
IC50
2350±n/a nM
Citation
 PubChem, PC Dose Response confirmation of uHTS hits from a small molecule inhibitors of mouse intestinal alkaline phosphatase via a luminescent assay PubChem Bioassay (2010)[AID] 
Target
Name:
Intestinal-type alkaline phosphatase 1
Synonyms:
Alpi | PPBI1_RAT
Type:
Enzyme Catalytic Domain
Mol. Mass.:
58396.39
Organism:
Rattus norvegicus (Rat)
Description:
P15693
Residue:
540
  
Inhibitor
Name:
BDBM58703
Synonyms:
1-(4-tert-butylcyclohexyl)-3-(4-methylbenzyl)thiourea MLS001224435 cid_20179921
Type:
Small organic molecule
Emp. Form.:
C19H30N2S
Mol. Mass.:
318.52
SMILES:
Cc1ccc(CNC(=S)NC2CCC(CC2)C(C)(C)C)cc1
: