Target
Integrin alpha-4
Ligand
BDBM50040780
Substrate
Meas. Tech.
SAR Confirmatory Dose Response LIBS Assay for Allosteric Ligands of the VLA-4 Integrin
EC50
334.1±n/a nM
Citation
 PubChem, PC SAR Confirmatory Dose Response LIBS Assay for Allosteric Ligands of the VLA-4 Integrin PubChem Bioassay (2010)[AID] 
Target
Name:
Integrin alpha-4
Synonyms:
CD49 antigen-like family member D CD49d antigen ITA4_HUMAN Integrin alpha-4 Integrin alpha-IV VLA-4 integrin alpha 4 precursor | integrin alpha-4 precursor
Type:
Membrane Protein
Mol. Mass.:
114897.35
Organism:
Homo sapiens (Human)
Description:
P13612
Residue:
1032
  
Inhibitor
Name:
BDBM50040780
Synonyms:
CHEMBL163958 spiro[9H-fluorene-9,4'-(tetrahydro-1'H-imidazole)]-2',5'-dione
Type:
Small organic molecule
Emp. Form.:
C15H10N2O2
Mol. Mass.:
250.2521
SMILES:
O=C1NC(=O)C2(N1)c1ccccc1-c1ccccc21
: