Target
cAMP-dependent protein kinase catalytic subunit alpha
Ligand
BDBM2583
Substrate
Lysine-rich histone
Meas. Tech.
PKC assay
pH
7.4±n/a
Temperature
303.15±n/a K
IC50
100±50 nM
Citation
 Toullec, DPianetti, PCoste, HBellevergue, PGrand-Perret, TAjakane, MBaudet, VBoissin, PBoursier, ELoriolle, F The bisindolylmaleimide GF 109203X is a potent and selective inhibitor of protein kinase C. J Biol Chem 266:15771-81 (1991) Target
Name:
cAMP-dependent protein kinase catalytic subunit alpha
Synonyms:
KAPCA_BOVIN PKC Protein Kinase C cAMP-Dependent Protein Kinase (PKA) cAMP-dependent protein kinase A cAMP-dependent protein kinase, alpha-catalytic subunit
Type:
Enzyme Complex
Mol. Mass.:
40627.77
Organism:
Bos taurus (bovine)
Description:
The PKA holoenzyme purified from bovine heart, exists as an inactive tetrameric complex, which consists of a regulatory dimer associated with two catalytic subunits. It requires cAMP to activate the enzymatic reaction.
Residue:
351
  
Inhibitor
Name:
BDBM2583
Synonyms:
3,4-Bis(3-indolyl)-1H-pyrrole-2,5-dione BIM-4 Bisindolylmaleimide deriv. 5 bis-indolylmaleimide deriv. 8a
Type:
Small organic molecule
Emp. Form.:
C20H13N3O2
Mol. Mass.:
327.3361
SMILES:
O=C1NC(=O)C(=C1c1c[nH]c2ccccc12)c1c[nH]c2ccccc12
:
Substrate
Name:
Lysine-rich histone
Synonyms:
ING Peptide histone type IIIS
Type:
Peptide
Mol. Mass.:
10508.21
Organism:
Bos taurus (bovine)
Description:
Purified as a lysine rich fraction of histone H1 from calf thymus.
Residue:
105