Target
Tyrosine-protein phosphatase non-receptor type 7
Ligand
BDBM55688
Substrate
Meas. Tech.
Dose Response confirmation of compounds that inhibit HePTP
IC50
4450±n/a nM
Citation
 PubChem, PC Dose Response confirmation of compounds that inhibit HePTP PubChem Bioassay (2010)[AID] 
Target
Name:
Tyrosine-protein phosphatase non-receptor type 7
Synonyms:
He-PTP Hematopoietic protein-tyrosine phosphatase (HEPTP) PTPN7 Tyrosine-protein phosphatase non-receptor type 7 | Tyrosine-protein phosphatase non-receptor type 7 (HEPTP)
Type:
Protein
Mol. Mass.:
40530.79
Organism:
Homo sapiens (Human)
Description:
P35236
Residue:
360
  
Inhibitor
Name:
BDBM55688
Synonyms:
6-bromanyl-N-[2-(2-methoxyphenyl)ethyl]-2-pyridin-4-yl-quinoline-4-carboxamide 6-bromo-N-[2-(2-methoxyphenyl)ethyl]-2-(4-pyridyl)cinchoninamide 6-bromo-N-[2-(2-methoxyphenyl)ethyl]-2-pyridin-4-ylquinoline-4-carboxamide SMR000295438 | cid_1261460
Type:
Small organic molecule
Emp. Form.:
C24H20BrN3O2
Mol. Mass.:
462.339
SMILES:
COc1ccccc1CCNC(=O)c1cc(nc2ccc(Br)cc12)-c1ccncc1
: