Target
Tyrosine-protein phosphatase non-receptor type 7
Ligand
BDBM75990
Substrate
Meas. Tech.
Dose Response confirmation of compounds that inhibit HePTP
IC50
5360±n/a nM
Citation
 PubChem, PC Dose Response confirmation of compounds that inhibit HePTP PubChem Bioassay (2010)[AID] 
Target
Name:
Tyrosine-protein phosphatase non-receptor type 7
Synonyms:
He-PTP Hematopoietic protein-tyrosine phosphatase (HEPTP) PTPN7 Tyrosine-protein phosphatase non-receptor type 7 | Tyrosine-protein phosphatase non-receptor type 7 (HEPTP)
Type:
Protein
Mol. Mass.:
40530.79
Organism:
Homo sapiens (Human)
Description:
P35236
Residue:
360
  
Inhibitor
Name:
BDBM75990
Synonyms:
MLS000765462 N-[2-(3-pyridinyl)-1,3-benzoxazol-5-yl]-2,3-dihydro-1,4-benzodioxin-6-carboxamide SMR000289567 | cid_1160074
Type:
Small organic molecule
Emp. Form.:
C21H15N3O4
Mol. Mass.:
373.3615
SMILES:
O=C(Nc1ccc2oc(nc2c1)-c1cccnc1)c1ccc2OCCOc2c1
: